Problemi con Amule 2.0.0.rc7

1 risposta [Ultimo messaggio]
Ritratto di danylele74
danylele74
(Junior)
Offline
Junior
Iscritto: 06/11/2004
Messaggi: 40

Ciao a tutti.

Sono 2 giorni che cerco di installare Amule 2.0.0rc7 ma non ci riesco.

Dopo aver digitato il comando: ./configure
digito il comando: make
e questo è il risultato:

[root@daniele aMule-2.0.0rc7]# make
make all-recursive
make[1]: Entering directory `/home/daniele/p2p/aMule-2.0.0rc7'
Making all in m4
make[2]: Entering directory `/home/daniele/p2p/aMule-2.0.0rc7/m4'
make[2]: Nothing to be done for `all'.
make[2]: Leaving directory `/home/daniele/p2p/aMule-2.0.0rc7/m4'
Making all in intl
make[2]: Entering directory `/home/daniele/p2p/aMule-2.0.0rc7/intl'
make[2]: Nothing to be done for `all'.
make[2]: Leaving directory `/home/daniele/p2p/aMule-2.0.0rc7/intl'
Making all in po
make[2]: Entering directory `/home/daniele/p2p/aMule-2.0.0rc7/po'
make[2]: Nothing to be done for `all'.
make[2]: Leaving directory `/home/daniele/p2p/aMule-2.0.0rc7/po'
Making all in docs
make[2]: Entering directory `/home/daniele/p2p/aMule-2.0.0rc7/docs'
make[2]: Nothing to be done for `all'.
make[2]: Leaving directory `/home/daniele/p2p/aMule-2.0.0rc7/docs'
Making all in src
make[2]: Entering directory `/home/daniele/p2p/aMule-2.0.0rc7/src'
make all-recursive
make[3]: Entering directory `/home/daniele/p2p/aMule-2.0.0rc7/src'
Making all in utils
make[4]: Entering directory `/home/daniele/p2p/aMule-2.0.0rc7/src/utils'
Making all in xas
make[5]: Entering directory `/home/daniele/p2p/aMule-2.0.0rc7/src/utils/xas'
make[5]: Nothing to be done for `all'.
make[5]: Leaving directory `/home/daniele/p2p/aMule-2.0.0rc7/src/utils/xas'
Making all in cas
make[5]: Entering directory `/home/daniele/p2p/aMule-2.0.0rc7/src/utils/cas'
make[5]: Nothing to be done for `all'.
make[5]: Leaving directory `/home/daniele/p2p/aMule-2.0.0rc7/src/utils/cas'
Making all in wxCas
make[5]: Entering directory `/home/daniele/p2p/aMule-2.0.0rc7/src/utils/wxCas'
Making all in src
make[6]: Entering directory `/home/daniele/p2p/aMule-2.0.0rc7/src/utils/wxCas/src'
if g++ -DHAVE_CONFIG_H -I. -I. -I../../../.. -I/usr/local/lib/wx/include/base-ansi-release-2.5 -I/usr/local/include/wx-2.5 -DwxUSE_GUI=0 -D_FILE_OFFSET_BITS=64 -D_LARGE_FILES -DWX_PRECOMP -DNO_GCC_PRAGMA -DUSE_EMBEDDED_CRYPTO -W -Wall -g -ggdb -fno-inline -D__DEBUG__ -fmessage-length=0 -MT wxcas-onlinesig.o -MD -MP -MF ".deps/wxcas-onlinesig.Tpo" \
-c -o wxcas-onlinesig.o `test -f 'onlinesig.cpp' || echo './'`onlinesig.cpp; \
then mv -f ".deps/wxcas-onlinesig.Tpo" ".deps/wxcas-onlinesig.Po"; \
else rm -f ".deps/wxcas-onlinesig.Tpo"; exit 1; \
fi
if g++ -DHAVE_CONFIG_H -I. -I. -I../../../.. -I/usr/local/lib/wx/include/base-ansi-release-2.5 -I/usr/local/include/wx-2.5 -DwxUSE_GUI=0 -D_FILE_OFFSET_BITS=64 -D_LARGE_FILES -DWX_PRECOMP -DNO_GCC_PRAGMA -DUSE_EMBEDDED_CRYPTO -W -Wall -g -ggdb -fno-inline -D__DEBUG__ -fmessage-length=0 -MT wxcas-linuxmon.o -MD -MP -MF ".deps/wxcas-linuxmon.Tpo" \
-c -o wxcas-linuxmon.o `test -f 'linuxmon.cpp' || echo './'`linuxmon.cpp; \
then mv -f ".deps/wxcas-linuxmon.Tpo" ".deps/wxcas-linuxmon.Po"; \
else rm -f ".deps/wxcas-linuxmon.Tpo"; exit 1; \
fi
if g++ -DHAVE_CONFIG_H -I. -I. -I../../../.. -I/usr/local/lib/wx/include/base-ansi-release-2.5 -I/usr/local/include/wx-2.5 -DwxUSE_GUI=0 -D_FILE_OFFSET_BITS=64 -D_LARGE_FILES -DWX_PRECOMP -DNO_GCC_PRAGMA -DUSE_EMBEDDED_CRYPTO -W -Wall -g -ggdb -fno-inline -D__DEBUG__ -fmessage-length=0 -MT wxcas-wxcas.o -MD -MP -MF ".deps/wxcas-wxcas.Tpo" \
-c -o wxcas-wxcas.o `test -f 'wxcas.cpp' || echo './'`wxcas.cpp; \
then mv -f ".deps/wxcas-wxcas.Tpo" ".deps/wxcas-wxcas.Po"; \
else rm -f ".deps/wxcas-wxcas.Tpo"; exit 1; \
fi
wxcas.cpp:51:2: #error You must set wxUSE_PRINTING_ARCHITECTURE to 1 in setup.h to compile wxCas.
wxcas.cpp:54:22: wx/image.h: No such file or directory
In file included from wxcas.h:49,
from wxcas.cpp:57:
wxcasframe.h:49:25: wx/statline.h: No such file or directory
wxcasframe.h:50:24: wx/toolbar.h: No such file or directory
In file included from wxcas.h:49,
from wxcas.cpp:57:
wxcasframe.h:63: error: invalid use of undefined type `struct wxFrame'
/usr/local/include/wx-2.5/wx/utils.h:52: error: forward declaration of `struct wxFrame'
wxcasframe.h:65: error: ISO C++ forbids declaration of `wxToolBar' with no type
wxcasframe.h:65: error: expected `;' before '*' token
wxcasframe.h:66: error: `wxBitmap' does not name a type
wxcasframe.h:68: error: ISO C++ forbids declaration of `wxBoxSizer' with no type
wxcasframe.h:68: error: expected `;' before '*' token
wxcasframe.h:69: error: ISO C++ forbids declaration of `wxBoxSizer' with no type
wxcasframe.h:69: error: expected `;' before '*' token
wxcasframe.h:71: error: ISO C++ forbids declaration of `wxPanel' with no type
wxcasframe.h:71: error: expected `;' before '*' token
wxcasframe.h:73: error: ISO C++ forbids declaration of `wxStaticLine' with no type
wxcasframe.h:73: error: expected `;' before '*' token
wxcasframe.h:79: error: ISO C++ forbids declaration of `wxStaticBox' with no type
wxcasframe.h:79: error: expected `;' before '*' token
wxcasframe.h:80: error: ISO C++ forbids declaration of `wxStaticBoxSizer' with no type
wxcasframe.h:80: error: expected `;' before '*' token
wxcasframe.h:82: error: ISO C++ forbids declaration of `wxStaticBox' with no type
wxcasframe.h:82: error: expected `;' before '*' token
wxcasframe.h:83: error: ISO C++ forbids declaration of `wxStaticBoxSizer' with no type
wxcasframe.h:83: error: expected `;' before '*' token
wxcasframe.h:85: error: ISO C++ forbids declaration of `wxStaticBox' with no type
wxcasframe.h:85: error: expected `;' before '*' token
wxcasframe.h:86: error: ISO C++ forbids declaration of `wxStaticBoxSizer' with no type
wxcasframe.h:86: error: expected `;' before '*' token
wxcasframe.h:88: error: ISO C++ forbids declaration of `wxStaticBox' with no type
wxcasframe.h:88: error: expected `;' before '*' token
wxcasframe.h:89: error: ISO C++ forbids declaration of `wxStaticBoxSizer' with no type
wxcasframe.h:89: error: expected `;' before '*' token
wxcasframe.h:91: error: ISO C++ forbids declaration of `wxStaticText' with no type
wxcasframe.h:91: error: expected `;' before '*' token
wxcasframe.h:92: error: ISO C++ forbids declaration of `wxStaticText' with no type
wxcasframe.h:92: error: expected `;' before '*' token
wxcasframe.h:93: error: ISO C++ forbids declaration of `wxStaticText' with no type
wxcasframe.h:93: error: expected `;' before '*' token
wxcasframe.h:94: error: ISO C++ forbids declaration of `wxStaticText' with no type
wxcasframe.h:94: error: expected `;' before '*' token
wxcasframe.h:95: error: ISO C++ forbids declaration of `wxStaticText' with no type
wxcasframe.h:95: error: expected `;' before '*' token
wxcasframe.h:96: error: ISO C++ forbids declaration of `wxStaticText' with no type
wxcasframe.h:96: error: expected `;' before '*' token
wxcasframe.h:98: error: ISO C++ forbids declaration of `wxStaticText' with no type
wxcasframe.h:98: error: expected `;' before '*' token
wxcasframe.h:99: error: ISO C++ forbids declaration of `wxButton' with no type
wxcasframe.h:99: error: expected `;' before '*' token
wxcasframe.h:101: error: ISO C++ forbids declaration of `wxStaticText' with no type
wxcasframe.h:101: error: expected `;' before '*' token
wxcasframe.h:102: error: ISO C++ forbids declaration of `wxButton' with no type
wxcasframe.h:102: error: expected `;' before '*' token
wxcasframe.h:105: error: ISO C++ forbids declaration of `wxTimer' with no type
wxcasframe.h:105: error: expected `;' before '*' token
wxcasframe.h:106: error: ISO C++ forbids declaration of `wxTimer' with no type
wxcasframe.h:106: error: expected `;' before '*' token
wxcasframe.h:113: error: ISO C++ forbids declaration of `wxStaticText' with no type
wxcasframe.h:113: error: expected `;' before '*' token
wxcasframe.h:114: error: ISO C++ forbids declaration of `wxStaticText' with no type
wxcasframe.h:114: error: expected `;' before '*' token
wxcasframe.h:160: error: variable or field `OnBarRefresh' declared void
wxcasframe.h:160: error: expected `;' before '(' token
wxcasframe.h:161: error: variable or field `OnBarAbout' declared void
wxcasframe.h:161: error: expected `;' before '(' token
wxcasframe.h:162: error: variable or field `OnBarSave' declared void
wxcasframe.h:162: error: expected `;' before '(' token
wxcasframe.h:163: error: variable or field `OnBarPrint' declared void
wxcasframe.h:163: error: expected `;' before '(' token
wxcasframe.h:164: error: variable or field `OnBarPrefs' declared void
wxcasframe.h:164: error: expected `;' before '(' token
wxcasframe.h:165: error: variable or field `OnRefreshTimer' declared void
wxcasframe.h:165: error: expected `;' before '(' token
wxcasframe.h:166: error: variable or field `OnFtpUpdateTimer' declared void
wxcasframe.h:166: error: expected `;' before '(' token
wxcasframe.h:167: error: variable or field `OnHitButton' declared void
wxcasframe.h:167: error: expected `;' before '(' token
wxcasframe.h:168: error: variable or field `OnAbsHitButton' declared void
wxcasframe.h:168: error: expected `;' before '(' token
wxcasframe.h:180: error: ISO C++ forbids declaration of `wxImage' with no type
wxcasframe.h:180: error: expected `;' before '*' token
wxcasframe.h:63: warning: `class WxCasFrame' has virtual functions but non-virtual destructor
wxcas.cpp: In function `wxAppConsole* wxCreateApp()':
wxcas.cpp:60: error: cannot allocate an object of type `WxCas'
wxcas.cpp:60: error: because the following virtual functions are abstract:
/usr/local/include/wx-2.5/wx/app.h:100: error: virtual int wxAppConsole::OnRun()
wxcas.cpp: In member function `virtual bool WxCas::OnInit()':
wxcas.cpp:71: error: `wxImage' has not been declared
wxcas.cpp:71: error: `wxPNGHandler' has not been declared
wxcas.cpp:71: error: `AddHandler' undeclared (first use this function)
wxcas.cpp:71: error: (Each undeclared identifier is reported only once for each function it appears in.)
wxcas.cpp:76: error: `wxImage' has not been declared
wxcas.cpp:76: error: `wxJPEGHandler' has not been declared
wxcas.cpp:84: error: `SetPrintMode' undeclared (first use this function)
wxcas.cpp:94: error: 'class WxCasFrame' has no member named 'Show'
wxcas.cpp:95: error: `SetTopWindow' undeclared (first use this function)
make[6]: *** [wxcas-wxcas.o] Error 1
make[6]: Leaving directory `/home/daniele/p2p/aMule-2.0.0rc7/src/utils/wxCas/src'
make[5]: *** [all-recursive] Error 1
make[5]: Leaving directory `/home/daniele/p2p/aMule-2.0.0rc7/src/utils/wxCas'
make[4]: *** [all-recursive] Error 1
make[4]: Leaving directory `/home/daniele/p2p/aMule-2.0.0rc7/src/utils'
make[3]: *** [all-recursive] Error 1
make[3]: Leaving directory `/home/daniele/p2p/aMule-2.0.0rc7/src'
make[2]: *** [all] Error 2
make[2]: Leaving directory `/home/daniele/p2p/aMule-2.0.0rc7/src'
make[1]: *** [all-recursive] Error 1
make[1]: Leaving directory `/home/daniele/p2p/aMule-2.0.0rc7'
make: *** [all] Error 2

Che cosa devo fare?? Cosa c'è che non va?? Aiutatemi, vi prego.
Grazie.

p.s.

Uso mandrake 10.1 official powerPack

Mandrake 10.1 Official PowerPack, Modem ADSL Ethernet/USB

Ritratto di Pinguino
Pinguino
(Guru)
Offline
Guru
Iscritto: 14/09/2004
Messaggi: 2918

Installa gli RPM seguendo attentamente le istruzioni sul sito di amule (ci ho fatto un salto giusto ora)..

MDK 10.1: (ThePolish)
Pack aMule-2.0.0rc7 + wx-2.5.3 for 10.1 Unicoded
NOTE:You must use BOTH aMule and wx packages provided here, and desinstall all other previous wx and aMule packages to avoid conflict. You will have unicode and gtk2 support.

Anche dalla compilazione sembra che i problemi siano nell librerie wx.

Ciao.

Proud linux user # 372467 @ http://counter.li.org
Mandriva Cooker 2008 - Kernel 2.6.17-14mdv - KDE 3.5.7 - Gnome 2.16