installazione tar.gz errore make

3 risposte [Ultimo messaggio]
Ritratto di robren66
robren66
(Junior)
Offline
Junior
Iscritto: 07/11/2005
Messaggi: 31

durante l'installazione di un file tar.gz in terminale mi da i seguenti errori...

[rob@localhost ~]$ cd /home/rob/Documenti/ZD1211LnxDrv_2_22_0_0
[rob@localhost ZD1211LnxDrv_2_22_0_0]$ make
make both
make[1]: Entering directory `/home/rob/Documenti/ZD1211LnxDrv_2_22_0_0'
make clean
make[2]: Entering directory `/home/rob/Documenti/ZD1211LnxDrv_2_22_0_0'
rm -rf .tmp_versions .*.cmd *.ko *.mod.c *.mod.o *.o src/*.o src/.*.o.cmd menudbg apdbg winevl_iface
make[2]: Leaving directory `/home/rob/Documenti/ZD1211LnxDrv_2_22_0_0'
make ZD1211REV_B=0
make[2]: Entering directory `/home/rob/Documenti/ZD1211LnxDrv_2_22_0_0'
/lib/modules/2.6.29.3-desktop586-1mnb/build
/home/rob/Documenti/ZD1211LnxDrv_2_22_0_0
-fomit-frame-pointer -Os -Wall -Wstrict-prototypes -pipe -Wno-unused -DZDCONF_WE_STAT_SUPPORT=1 -DHOST_IF_USB -DAMAC -DGCCK -DOFDM -DHOSTAPD_SUPPORT -DUSE_EP4_SET_REG -DDOWNLOADFIRMWARE -DfTX_GAIN_OFDM=0 -DfNEW_CODE_MAP=1 -DfWRITE_WORD_REG=1 -DfREAD_MUL_REG=1 -DENHANCE_RX=1 -DZDCONF_MENUDBG -DZDCONF_APDBG -DZDCONF_BANDEDGE_ADJUST -DZDCONF_SES_SUPPORT=1 -DAAAA03_FIX=1 -DZDCONF_FULL_TIM_FIX=1 -DZDCONF_IWPRIV_CONNECT=1 -DZDCONF_REGION_CONFIG=1 -DZDCONF_MIC_CHECK=1 -DZDCONF_SETMULTI_SUPPORT=1 -DZDCONF_SETMAC_SUPPORT=1 -DZDCONF_PSEUDO_SUPPORT=1 -DZDCONF_FULL_IDS=1 -DZDCONF_SIGNAL_INFO=1 -DZDCONF_STA_PSM=0 -DZDCONF_DBGMSG_NORMAL=1 -DZDCONF_EXTRA_FIX_IPC=1 -DZDCONF_ADHOC_SUPPORT=1 -DZDCONF_AP_SUPPORT=1 -DPRODUCTION=1 -DZDCONF_RF_RFMD_SUPPORT=1 -DZDCONF_RF_AR2124_SUPPORT=1 -DZDCONF_RF_UW2453_SUPPORT=1 -DZDCONF_RF_AL2232_SUPPORT=1 -DZDCONF_RF_AL2230_SUPPORT=1 -DZDCONF_RF_AL7230B_SUPPORT=1 -DZDCONF_DRV_FORWARD=0 -DZDCONF_APC=1 -DZDCONF_80211A_SUPPORT=1 -DZDCONF_R8610_FRAG_FIX=0 -DZDCONF_DEFER_RX=0 -DZDCONF_TX_NOCOPY=0 -DZDCONF_WPS_SUPPORT=1 -DZDCONF_RATE_DEGRADE=0 -DZD1211
src/zd1205.o src/zdreq.o src/zdasocsvc.o src/zdauthreq.o src/zdauthrsp.o src/zdmmrx.o src/zdshared.o src/zdhci.o src/zdglobal.o src/zdencrypt.o src/zdpmfilter.o src/zdpsmon.o src/zdsynch.o src/zdbuf.o src/zd1205_proc.o src/zdhw.o src/zddebug.o src/zdmic.o src/zddebug2.o src/zdlpmgt.o src/zdturbo_burst.o src/zdusb.o src/zdmisc.o src/zd1211.o
make -C /lib/modules/2.6.29.3-desktop586-1mnb/build SUBDIRS=/home/rob/Documenti/ZD1211LnxDrv_2_22_0_0 modules
make[3]: Entering directory `/usr/src/linux-2.6.29.3-desktop586-1mnb'
CC [M] /home/rob/Documenti/ZD1211LnxDrv_2_22_0_0/src/zd1205.o
In file included from /home/rob/Documenti/ZD1211LnxDrv_2_22_0_0/src/zdapi.h:5,
from /home/rob/Documenti/ZD1211LnxDrv_2_22_0_0/src/zd1205.h:51,
from /home/rob/Documenti/ZD1211LnxDrv_2_22_0_0/src/zd1205.c:41:
/home/rob/Documenti/ZD1211LnxDrv_2_22_0_0/src/zdsorts.h:261:5: warning: "ZDCONF_LP_SUPPORT" is not defined
/home/rob/Documenti/ZD1211LnxDrv_2_22_0_0/src/zdsorts.h:318:5: warning: "ZDCONF_LP_SUPPORT" is not defined
In file included from /home/rob/Documenti/ZD1211LnxDrv_2_22_0_0/src/zd1205.h:51,
from /home/rob/Documenti/ZD1211LnxDrv_2_22_0_0/src/zd1205.c:41:
/home/rob/Documenti/ZD1211LnxDrv_2_22_0_0/src/zdapi.h:352:5: warning: "ZDCONF_LP_SUPPORT" is not defined
/home/rob/Documenti/ZD1211LnxDrv_2_22_0_0/src/zdapi.h:395:5: warning: "ZDCONF_LP_SUPPORT" is not defined
/home/rob/Documenti/ZD1211LnxDrv_2_22_0_0/src/zdapi.h:489:5: warning: "ZDCONF_LP_SUPPORT" is not defined
In file included from /home/rob/Documenti/ZD1211LnxDrv_2_22_0_0/src/zd1205.c:41:
/home/rob/Documenti/ZD1211LnxDrv_2_22_0_0/src/zd1205.h:705:5: warning: "ZDCONF_LP_SUPPORT" is not defined
/home/rob/Documenti/ZD1211LnxDrv_2_22_0_0/src/zd1205.h:938:5: warning: "ZDCONF_LP_SUPPORT" is not defined
In file included from /home/rob/Documenti/ZD1211LnxDrv_2_22_0_0/src/zd1205.c:42:
/home/rob/Documenti/ZD1211LnxDrv_2_22_0_0/src/zdinlinef.h:551:5: warning: "ZDCONF_ENABLE_USELESS_FUNCTION" is not defined
In file included from /home/rob/Documenti/ZD1211LnxDrv_2_22_0_0/src/zd1205.c:53:
/home/rob/Documenti/ZD1211LnxDrv_2_22_0_0/src/zd1211.h:114:6: warning: "fDRV_UPDATE_EEP" is not defined
/home/rob/Documenti/ZD1211LnxDrv_2_22_0_0/src/zd1205.c:61:5: warning: "ZDCONF_LP_SUPPORT" is not defined
/home/rob/Documenti/ZD1211LnxDrv_2_22_0_0/src/zd1205.c:320:5: warning: "ZDCONF_LP_SUPPORT" is not defined
/home/rob/Documenti/ZD1211LnxDrv_2_22_0_0/src/zd1205.c:374:5: warning: "ZDCONF_LP_SUPPORT" is not defined
/home/rob/Documenti/ZD1211LnxDrv_2_22_0_0/src/zd1205.c:466: warning: initialization from incompatible pointer type
/home/rob/Documenti/ZD1211LnxDrv_2_22_0_0/src/zd1205.c:585:1: warning: "cPWR_INT_VALUE_GUARD" redefined
In file included from /home/rob/Documenti/ZD1211LnxDrv_2_22_0_0/src/zd1205.h:50,
from /home/rob/Documenti/ZD1211LnxDrv_2_22_0_0/src/zd1205.c:41:
/home/rob/Documenti/ZD1211LnxDrv_2_22_0_0/src/zdequates.h:89:1: warning: this is the location of the previous definition
/home/rob/Documenti/ZD1211LnxDrv_2_22_0_0/src/zd1205.c: In function ‘zd_writel’:
/home/rob/Documenti/ZD1211LnxDrv_2_22_0_0/src/zd1205.c:806: error: ‘struct net_device’ has no member named ‘priv’
/home/rob/Documenti/ZD1211LnxDrv_2_22_0_0/src/zd1205.c:812:9: warning: "fPROG_FLASH" is not defined
/home/rob/Documenti/ZD1211LnxDrv_2_22_0_0/src/zd1205.c: In function ‘zd_readl’:
/home/rob/Documenti/ZD1211LnxDrv_2_22_0_0/src/zd1205.c:846: error: ‘struct net_device’ has no member named ‘priv’
/home/rob/Documenti/ZD1211LnxDrv_2_22_0_0/src/zd1205.c:852:9: warning: "fPROG_FLASH" is not defined
/home/rob/Documenti/ZD1211LnxDrv_2_22_0_0/src/zd1205.c: In function ‘zd1205_enable_int’:
/home/rob/Documenti/ZD1211LnxDrv_2_22_0_0/src/zd1205.c:895: error: ‘struct net_device’ has no member named ‘priv’
/home/rob/Documenti/ZD1211LnxDrv_2_22_0_0/src/zd1205.c: In function ‘zd1205_mgt_mon_cb’:
/home/rob/Documenti/ZD1211LnxDrv_2_22_0_0/src/zd1205.c:1279: error: ‘struct net_device’ has no member named ‘priv’
/home/rob/Documenti/ZD1211LnxDrv_2_22_0_0/src/zd1205.c: In function ‘HKeepingCB’:
/home/rob/Documenti/ZD1211LnxDrv_2_22_0_0/src/zd1205.c:1591: error: ‘struct net_device’ has no member named ‘priv’
/home/rob/Documenti/ZD1211LnxDrv_2_22_0_0/src/zd1205.c:1615:5: warning: "ZDCONF_LP_SUPPORT" is not defined
/home/rob/Documenti/ZD1211LnxDrv_2_22_0_0/src/zd1205.c:2124:5: warning: "ZDCONF_LP_SUPPORT" is not defined
/home/rob/Documenti/ZD1211LnxDrv_2_22_0_0/src/zd1205.c:4383:5: warning: "ZDCONF_LP_SUPPORT" is not defined
/home/rob/Documenti/ZD1211LnxDrv_2_22_0_0/src/zd1205.c: In function ‘zd1205_open’:
/home/rob/Documenti/ZD1211LnxDrv_2_22_0_0/src/zd1205.c:4608: error: ‘struct net_device’ has no member named ‘priv’
/home/rob/Documenti/ZD1211LnxDrv_2_22_0_0/src/zd1205.c:4618:5: warning: "ZDCONF_LP_SUPPORT" is not defined
/home/rob/Documenti/ZD1211LnxDrv_2_22_0_0/src/zd1205.c:4669:5: warning: "ZDCONF_LP_SUPPORT" is not defined
/home/rob/Documenti/ZD1211LnxDrv_2_22_0_0/src/zd1205.c: In function ‘zd1205_get_stats’:
/home/rob/Documenti/ZD1211LnxDrv_2_22_0_0/src/zd1205.c:4969: error: ‘struct net_device’ has no member named ‘priv’
/home/rob/Documenti/ZD1211LnxDrv_2_22_0_0/src/zd1205.c: In function ‘zd1205_set_mac’:
/home/rob/Documenti/ZD1211LnxDrv_2_22_0_0/src/zd1205.c:5014: error: ‘struct net_device’ has no member named ‘priv’
/home/rob/Documenti/ZD1211LnxDrv_2_22_0_0/src/zd1205.c:5082:5: warning: "ZDCONF_LP_SUPPORT" is not defined
/home/rob/Documenti/ZD1211LnxDrv_2_22_0_0/src/zd1205.c: In function ‘zd1205_close’:
/home/rob/Documenti/ZD1211LnxDrv_2_22_0_0/src/zd1205.c:5114: error: ‘struct net_device’ has no member named ‘priv’
/home/rob/Documenti/ZD1211LnxDrv_2_22_0_0/src/zd1205.c: In function ‘zd1205_xmit_frame’:
/home/rob/Documenti/ZD1211LnxDrv_2_22_0_0/src/zd1205.c:5225: error: ‘struct net_device’ has no member named ‘priv’
/home/rob/Documenti/ZD1211LnxDrv_2_22_0_0/src/zd1205.c:5246: warning: ISO C90 forbids mixed declarations and code
/home/rob/Documenti/ZD1211LnxDrv_2_22_0_0/src/zd1205.c:5247: warning: assignment from incompatible pointer type
/home/rob/Documenti/ZD1211LnxDrv_2_22_0_0/src/zd1205.c:5250: warning: assignment from incompatible pointer type
/home/rob/Documenti/ZD1211LnxDrv_2_22_0_0/src/zd1205.c:5780:5: warning: "ZDCONF_LP_SUPPORT" is not defined
/home/rob/Documenti/ZD1211LnxDrv_2_22_0_0/src/zd1205.c: In function ‘zd1205_set_multi’:
/home/rob/Documenti/ZD1211LnxDrv_2_22_0_0/src/zd1205.c:5916: error: ‘struct net_device’ has no member named ‘priv’
/home/rob/Documenti/ZD1211LnxDrv_2_22_0_0/src/zd1205.c:5970:5: warning: "ZDCONF_LP_SUPPORT" is not defined
/home/rob/Documenti/ZD1211LnxDrv_2_22_0_0/src/zd1205.c: In function ‘zd1205_watchdog_cb’:
/home/rob/Documenti/ZD1211LnxDrv_2_22_0_0/src/zd1205.c:6105: error: ‘struct net_device’ has no member named ‘priv’
/home/rob/Documenti/ZD1211LnxDrv_2_22_0_0/src/zd1205.c: In function ‘zd1205_ioctl_setiwencode’:
/home/rob/Documenti/ZD1211LnxDrv_2_22_0_0/src/zd1205.c:6423: error: ‘struct net_device’ has no member named ‘priv’
/home/rob/Documenti/ZD1211LnxDrv_2_22_0_0/src/zd1205.c: In function ‘zd1205_ioctl_getiwencode’:
/home/rob/Documenti/ZD1211LnxDrv_2_22_0_0/src/zd1205.c:6548: error: ‘struct net_device’ has no member named ‘priv’
/home/rob/Documenti/ZD1211LnxDrv_2_22_0_0/src/zd1205.c: In function ‘zd1205_ioctl_setessid’:
/home/rob/Documenti/ZD1211LnxDrv_2_22_0_0/src/zd1205.c:6592: error: ‘struct net_device’ has no member named ‘priv’
/home/rob/Documenti/ZD1211LnxDrv_2_22_0_0/src/zd1205.c: In function ‘zd1205_ioctl_getessid’:
/home/rob/Documenti/ZD1211LnxDrv_2_22_0_0/src/zd1205.c:6632: error: ‘struct net_device’ has no member named ‘priv’
/home/rob/Documenti/ZD1211LnxDrv_2_22_0_0/src/zd1205.c: In function ‘zd1205_ioctl_setfreq’:
/home/rob/Documenti/ZD1211LnxDrv_2_22_0_0/src/zd1205.c:6667: error: ‘struct net_device’ has no member named ‘priv’
/home/rob/Documenti/ZD1211LnxDrv_2_22_0_0/src/zd1205.c: In function ‘zd1205_ioctl_setrts’:
/home/rob/Documenti/ZD1211LnxDrv_2_22_0_0/src/zd1205.c:6740: error: ‘struct net_device’ has no member named ‘priv’
/home/rob/Documenti/ZD1211LnxDrv_2_22_0_0/src/zd1205.c: In function ‘zd1205_ioctl_setfrag’:
/home/rob/Documenti/ZD1211LnxDrv_2_22_0_0/src/zd1205.c:6764: error: ‘struct net_device’ has no member named ‘priv’
/home/rob/Documenti/ZD1211LnxDrv_2_22_0_0/src/zd1205.c:6776:5: warning: "ZDCONF_LP_SUPPORT" is not defined
/home/rob/Documenti/ZD1211LnxDrv_2_22_0_0/src/zd1205.c: In function ‘zd1205_ioctl_getfrag’:
/home/rob/Documenti/ZD1211LnxDrv_2_22_0_0/src/zd1205.c:6805: error: ‘struct net_device’ has no member named ‘priv’
/home/rob/Documenti/ZD1211LnxDrv_2_22_0_0/src/zd1205.c: In function ‘zd1205_ioctl_setrate’:
/home/rob/Documenti/ZD1211LnxDrv_2_22_0_0/src/zd1205.c:6823: error: ‘struct net_device’ has no member named ‘priv’
/home/rob/Documenti/ZD1211LnxDrv_2_22_0_0/src/zd1205.c:6868: warning: format ‘%ld’ expects type ‘long int’, but argument 2 has type ‘__s32’
/home/rob/Documenti/ZD1211LnxDrv_2_22_0_0/src/zd1205.c: In function ‘zd1205_ioctl_getrate’:
/home/rob/Documenti/ZD1211LnxDrv_2_22_0_0/src/zd1205.c:6879: error: ‘struct net_device’ has no member named ‘priv’
/home/rob/Documenti/ZD1211LnxDrv_2_22_0_0/src/zd1205.c: In function ‘zd1205_ioctl_setpower’:
/home/rob/Documenti/ZD1211LnxDrv_2_22_0_0/src/zd1205.c:7000: error: ‘struct net_device’ has no member named ‘priv’
/home/rob/Documenti/ZD1211LnxDrv_2_22_0_0/src/zd1205.c: In function ‘zd1205_ioctl_getpower’:
/home/rob/Documenti/ZD1211LnxDrv_2_22_0_0/src/zd1205.c:7044: error: ‘struct net_device’ has no member named ‘priv’
/home/rob/Documenti/ZD1211LnxDrv_2_22_0_0/src/zd1205.c: In function ‘zd1205_ioctl_setmode’:
/home/rob/Documenti/ZD1211LnxDrv_2_22_0_0/src/zd1205.c:7076: error: ‘struct net_device’ has no member named ‘priv’
/home/rob/Documenti/ZD1211LnxDrv_2_22_0_0/src/zd1205.c:7119: warning: large integer implicitly truncated to unsigned type
/home/rob/Documenti/ZD1211LnxDrv_2_22_0_0/src/zd1205.c:7127: warning: large integer implicitly truncated to unsigned type
/home/rob/Documenti/ZD1211LnxDrv_2_22_0_0/src/zd1205.c: In function ‘zd1205wext_giwfreq’:
/home/rob/Documenti/ZD1211LnxDrv_2_22_0_0/src/zd1205.c:7197: error: ‘struct net_device’ has no member named ‘priv’
/home/rob/Documenti/ZD1211LnxDrv_2_22_0_0/src/zd1205.c: In function ‘zd1205wext_giwmode’:
/home/rob/Documenti/ZD1211LnxDrv_2_22_0_0/src/zd1205.c:7213: error: ‘struct net_device’ has no member named ‘priv’
/home/rob/Documenti/ZD1211LnxDrv_2_22_0_0/src/zd1205.c: In function ‘zd1205wext_giwrts’:
/home/rob/Documenti/ZD1211LnxDrv_2_22_0_0/src/zd1205.c:7255: error: ‘struct net_device’ has no member named ‘priv’
/home/rob/Documenti/ZD1211LnxDrv_2_22_0_0/src/zd1205.c: In function ‘zd1205wext_siwscan’:
/home/rob/Documenti/ZD1211LnxDrv_2_22_0_0/src/zd1205.c:7375: error: ‘struct net_device’ has no member named ‘priv’
/home/rob/Documenti/ZD1211LnxDrv_2_22_0_0/src/zd1205.c: In function ‘zd1205_translate_scan’:
/home/rob/Documenti/ZD1211LnxDrv_2_22_0_0/src/zd1205.c:7512: warning: passing argument 1 of ‘iwe_stream_add_event’ from incompatible pointer type
/home/rob/Documenti/ZD1211LnxDrv_2_22_0_0/src/zd1205.c:7512: warning: passing argument 3 of ‘iwe_stream_add_event’ from incompatible pointer type
/home/rob/Documenti/ZD1211LnxDrv_2_22_0_0/src/zd1205.c:7512: warning: passing argument 4 of ‘iwe_stream_add_event’ makes pointer from integer without a cast
/home/rob/Documenti/ZD1211LnxDrv_2_22_0_0/src/zd1205.c:7512: error: too few arguments to function ‘iwe_stream_add_event’
/home/rob/Documenti/ZD1211LnxDrv_2_22_0_0/src/zd1205.c:7522: warning: passing argument 1 of ‘iwe_stream_add_point’ from incompatible pointer type
/home/rob/Documenti/ZD1211LnxDrv_2_22_0_0/src/zd1205.c:7522: warning: passing argument 3 of ‘iwe_stream_add_point’ from incompatible pointer type
/home/rob/Documenti/ZD1211LnxDrv_2_22_0_0/src/zd1205.c:7522: warning: passing argument 4 of ‘iwe_stream_add_point’ from incompatible pointer type
/home/rob/Documenti/ZD1211LnxDrv_2_22_0_0/src/zd1205.c:7522: error: too few arguments to function ‘iwe_stream_add_point’
/home/rob/Documenti/ZD1211LnxDrv_2_22_0_0/src/zd1205.c:7533: warning: passing argument 1 of ‘iwe_stream_add_event’ from incompatible pointer type
/home/rob/Documenti/ZD1211LnxDrv_2_22_0_0/src/zd1205.c:7533: warning: passing argument 3 of ‘iwe_stream_add_event’ from incompatible pointer type
/home/rob/Documenti/ZD1211LnxDrv_2_22_0_0/src/zd1205.c:7533: warning: passing argument 4 of ‘iwe_stream_add_event’ makes pointer from integer without a cast
/home/rob/Documenti/ZD1211LnxDrv_2_22_0_0/src/zd1205.c:7533: error: too few arguments to function ‘iwe_stream_add_event’
/home/rob/Documenti/ZD1211LnxDrv_2_22_0_0/src/zd1205.c:7547: warning: passing argument 1 of ‘iwe_stream_add_event’ from incompatible pointer type
/home/rob/Documenti/ZD1211LnxDrv_2_22_0_0/src/zd1205.c:7547: warning: passing argument 3 of ‘iwe_stream_add_event’ from incompatible pointer type
/home/rob/Documenti/ZD1211LnxDrv_2_22_0_0/src/zd1205.c:7547: warning: passing argument 4 of ‘iwe_stream_add_event’ makes pointer from integer without a cast
/home/rob/Documenti/ZD1211LnxDrv_2_22_0_0/src/zd1205.c:7547: error: too few arguments to function ‘iwe_stream_add_event’
/home/rob/Documenti/ZD1211LnxDrv_2_22_0_0/src/zd1205.c:7575: warning: format ‘%lu’ expects type ‘long unsigned int’, but argument 4 has type ‘U32’
/home/rob/Documenti/ZD1211LnxDrv_2_22_0_0/src/zd1205.c:7577: warning: passing argument 1 of ‘iwe_stream_add_point’ from incompatible pointer type
/home/rob/Documenti/ZD1211LnxDrv_2_22_0_0/src/zd1205.c:7577: warning: passing argument 3 of ‘iwe_stream_add_point’ from incompatible pointer type
/home/rob/Documenti/ZD1211LnxDrv_2_22_0_0/src/zd1205.c:7577: warning: passing argument 4 of ‘iwe_stream_add_point’ from incompatible pointer type
/home/rob/Documenti/ZD1211LnxDrv_2_22_0_0/src/zd1205.c:7577: error: too few arguments to function ‘iwe_stream_add_point’
/home/rob/Documenti/ZD1211LnxDrv_2_22_0_0/src/zd1205.c:7596: warning: passing argument 1 of ‘iwe_stream_add_point’ from incompatible pointer type
/home/rob/Documenti/ZD1211LnxDrv_2_22_0_0/src/zd1205.c:7596: warning: passing argument 3 of ‘iwe_stream_add_point’ from incompatible pointer type
/home/rob/Documenti/ZD1211LnxDrv_2_22_0_0/src/zd1205.c:7596: warning: passing argument 4 of ‘iwe_stream_add_point’ from incompatible pointer type
/home/rob/Documenti/ZD1211LnxDrv_2_22_0_0/src/zd1205.c:7596: error: too few arguments to function ‘iwe_stream_add_point’
/home/rob/Documenti/ZD1211LnxDrv_2_22_0_0/src/zd1205.c:7609: warning: passing argument 1 of ‘iwe_stream_add_point’ from incompatible pointer type
/home/rob/Documenti/ZD1211LnxDrv_2_22_0_0/src/zd1205.c:7609: warning: passing argument 3 of ‘iwe_stream_add_point’ from incompatible pointer type
/home/rob/Documenti/ZD1211LnxDrv_2_22_0_0/src/zd1205.c:7609: warning: passing argument 4 of ‘iwe_stream_add_point’ from incompatible pointer type
/home/rob/Documenti/ZD1211LnxDrv_2_22_0_0/src/zd1205.c:7609: error: too few arguments to function ‘iwe_stream_add_point’
/home/rob/Documenti/ZD1211LnxDrv_2_22_0_0/src/zd1205.c:7626: warning: passing argument 1 of ‘iwe_stream_add_value’ from incompatible pointer type
/home/rob/Documenti/ZD1211LnxDrv_2_22_0_0/src/zd1205.c:7626: warning: passing argument 4 of ‘iwe_stream_add_value’ from incompatible pointer type
/home/rob/Documenti/ZD1211LnxDrv_2_22_0_0/src/zd1205.c:7626: warning: passing argument 5 of ‘iwe_stream_add_value’ makes pointer from integer without a cast
/home/rob/Documenti/ZD1211LnxDrv_2_22_0_0/src/zd1205.c:7626: error: too few arguments to function ‘iwe_stream_add_value’
/home/rob/Documenti/ZD1211LnxDrv_2_22_0_0/src/zd1205.c:7634: warning: passing argument 1 of ‘iwe_stream_add_value’ from incompatible pointer type
/home/rob/Documenti/ZD1211LnxDrv_2_22_0_0/src/zd1205.c:7634: warning: passing argument 4 of ‘iwe_stream_add_value’ from incompatible pointer type
/home/rob/Documenti/ZD1211LnxDrv_2_22_0_0/src/zd1205.c:7634: warning: passing argument 5 of ‘iwe_stream_add_value’ makes pointer from integer without a cast
/home/rob/Documenti/ZD1211LnxDrv_2_22_0_0/src/zd1205.c:7634: error: too few arguments to function ‘iwe_stream_add_value’
/home/rob/Documenti/ZD1211LnxDrv_2_22_0_0/src/zd1205.c:7650: warning: passing argument 1 of ‘iwe_stream_add_point’ from incompatible pointer type
/home/rob/Documenti/ZD1211LnxDrv_2_22_0_0/src/zd1205.c:7650: warning: passing argument 3 of ‘iwe_stream_add_point’ from incompatible pointer type
/home/rob/Documenti/ZD1211LnxDrv_2_22_0_0/src/zd1205.c:7650: warning: passing argument 4 of ‘iwe_stream_add_point’ from incompatible pointer type
/home/rob/Documenti/ZD1211LnxDrv_2_22_0_0/src/zd1205.c:7650: error: too few arguments to function ‘iwe_stream_add_point’
/home/rob/Documenti/ZD1211LnxDrv_2_22_0_0/src/zd1205.c:7668: warning: passing argument 1 of ‘iwe_stream_add_point’ from incompatible pointer type
/home/rob/Documenti/ZD1211LnxDrv_2_22_0_0/src/zd1205.c:7668: warning: passing argument 3 of ‘iwe_stream_add_point’ from incompatible pointer type
/home/rob/Documenti/ZD1211LnxDrv_2_22_0_0/src/zd1205.c:7668: warning: passing argument 4 of ‘iwe_stream_add_point’ from incompatible pointer type
/home/rob/Documenti/ZD1211LnxDrv_2_22_0_0/src/zd1205.c:7668: error: too few arguments to function ‘iwe_stream_add_point’
/home/rob/Documenti/ZD1211LnxDrv_2_22_0_0/src/zd1205.c:7681: warning: passing argument 1 of ‘iwe_stream_add_point’ from incompatible pointer type
/home/rob/Documenti/ZD1211LnxDrv_2_22_0_0/src/zd1205.c:7681: warning: passing argument 3 of ‘iwe_stream_add_point’ from incompatible pointer type
/home/rob/Documenti/ZD1211LnxDrv_2_22_0_0/src/zd1205.c:7681: warning: passing argument 4 of ‘iwe_stream_add_point’ from incompatible pointer type
/home/rob/Documenti/ZD1211LnxDrv_2_22_0_0/src/zd1205.c:7681: error: too few arguments to function ‘iwe_stream_add_point’
/home/rob/Documenti/ZD1211LnxDrv_2_22_0_0/src/zd1205.c: In function ‘zd1205wext_giwscan’:
/home/rob/Documenti/ZD1211LnxDrv_2_22_0_0/src/zd1205.c:7695: error: ‘struct net_device’ has no member named ‘priv’
/home/rob/Documenti/ZD1211LnxDrv_2_22_0_0/src/zd1205.c:7881:5: warning: "ZDCONF_LP_SUPPORT" is not defined
/home/rob/Documenti/ZD1211LnxDrv_2_22_0_0/src/zd1205.c: In function ‘zd1205_ioctl’:
/home/rob/Documenti/ZD1211LnxDrv_2_22_0_0/src/zd1205.c:7937: error: ‘struct net_device’ has no member named ‘priv’
/home/rob/Documenti/ZD1211LnxDrv_2_22_0_0/src/zd1205.c:8418:5: warning: "ZDCONF_LP_SUPPORT" is not defined
/home/rob/Documenti/ZD1211LnxDrv_2_22_0_0/src/zd1205.c:8862: warning: format ‘%x’ expects type ‘unsigned int’, but argument 2 has type ‘Element’
/home/rob/Documenti/ZD1211LnxDrv_2_22_0_0/src/zd1205.c:8997:5: warning: "fPROG_FLASH" is not defined
/home/rob/Documenti/ZD1211LnxDrv_2_22_0_0/src/zd1205.c: In function ‘zd1205_init’:
/home/rob/Documenti/ZD1211LnxDrv_2_22_0_0/src/zd1205.c:9001: error: ‘struct net_device’ has no member named ‘priv’
/home/rob/Documenti/ZD1211LnxDrv_2_22_0_0/src/zd1205.c:9705:5: warning: "ZDCONF_LP_SUPPORT" is not defined
/home/rob/Documenti/ZD1211LnxDrv_2_22_0_0/src/zd1205.c: In function ‘zdcb_setup_next_send’:
/home/rob/Documenti/ZD1211LnxDrv_2_22_0_0/src/zd1205.c:9710: error: ‘struct net_device’ has no member named ‘priv’
/home/rob/Documenti/ZD1211LnxDrv_2_22_0_0/src/zd1205.c:9743:5: warning: "ZDCONF_LP_SUPPORT" is not defined
/home/rob/Documenti/ZD1211LnxDrv_2_22_0_0/src/zd1205.c:9820:5: warning: "ZDCONF_LP_SUPPORT" is not defined
/home/rob/Documenti/ZD1211LnxDrv_2_22_0_0/src/zd1205.c:9910:5: warning: "ZDCONF_LP_SUPPORT" is not defined
/home/rob/Documenti/ZD1211LnxDrv_2_22_0_0/src/zd1205.c:10002:5: warning: "ZDCONF_LP_SUPPORT" is not defined
/home/rob/Documenti/ZD1211LnxDrv_2_22_0_0/src/zd1205.c:10045:5: warning: "ZDCONF_LP_SUPPORT" is not defined
/home/rob/Documenti/ZD1211LnxDrv_2_22_0_0/src/zd1205.c:10075:5: warning: "ZDCONF_LP_SUPPORT" is not defined
/home/rob/Documenti/ZD1211LnxDrv_2_22_0_0/src/zd1205.c:10090:5: warning: "ZDCONF_LP_SUPPORT" is not defined
/home/rob/Documenti/ZD1211LnxDrv_2_22_0_0/src/zd1205.c:10119:5: warning: "ZDCONF_LP_SUPPORT" is not defined
/home/rob/Documenti/ZD1211LnxDrv_2_22_0_0/src/zd1205.c:10231: warning: format ‘%x’ expects type ‘unsigned int’, but argument 2 has type ‘long unsigned int’
/home/rob/Documenti/ZD1211LnxDrv_2_22_0_0/src/zd1205.c:10232: warning: format ‘%x’ expects type ‘unsigned int’, but argument 2 has type ‘long unsigned int’
/home/rob/Documenti/ZD1211LnxDrv_2_22_0_0/src/zd1205.c: In function ‘zdcb_rx_ind’:
/home/rob/Documenti/ZD1211LnxDrv_2_22_0_0/src/zd1205.c:10357: error: ‘struct net_device’ has no member named ‘priv’
/home/rob/Documenti/ZD1211LnxDrv_2_22_0_0/src/zd1205.c:10371:5: warning: "ZDCONF_LP_SUPPORT" is not defined
/home/rob/Documenti/ZD1211LnxDrv_2_22_0_0/src/zd1205.c: In function ‘zdcb_status_notify’:
/home/rob/Documenti/ZD1211LnxDrv_2_22_0_0/src/zd1205.c:10639: error: ‘struct net_device’ has no member named ‘priv’
/home/rob/Documenti/ZD1211LnxDrv_2_22_0_0/src/zd1205.c: In function ‘chal_tout_cb’:
/home/rob/Documenti/ZD1211LnxDrv_2_22_0_0/src/zd1205.c:10740: error: ‘struct net_device’ has no member named ‘priv’
/home/rob/Documenti/ZD1211LnxDrv_2_22_0_0/src/zd1205.c: In function ‘scan_tout_cb’:
/home/rob/Documenti/ZD1211LnxDrv_2_22_0_0/src/zd1205.c:10750: error: ‘struct net_device’ has no member named ‘priv’
/home/rob/Documenti/ZD1211LnxDrv_2_22_0_0/src/zd1205.c: In function ‘asoc_tout_cb’:
/home/rob/Documenti/ZD1211LnxDrv_2_22_0_0/src/zd1205.c:10760: error: ‘struct net_device’ has no member named ‘priv’
/home/rob/Documenti/ZD1211LnxDrv_2_22_0_0/src/zd1205.c: In function ‘auth_tout_cb’:
/home/rob/Documenti/ZD1211LnxDrv_2_22_0_0/src/zd1205.c:10770: error: ‘struct net_device’ has no member named ‘priv’
/home/rob/Documenti/ZD1211LnxDrv_2_22_0_0/src/zd1205.c: In function ‘zdcb_start_timer’:
/home/rob/Documenti/ZD1211LnxDrv_2_22_0_0/src/zd1205.c:10779: error: ‘struct net_device’ has no member named ‘priv’
/home/rob/Documenti/ZD1211LnxDrv_2_22_0_0/src/zd1205.c: In function ‘zdcb_stop_timer’:
/home/rob/Documenti/ZD1211LnxDrv_2_22_0_0/src/zd1205.c:10832: error: ‘struct net_device’ has no member named ‘priv’
/home/rob/Documenti/ZD1211LnxDrv_2_22_0_0/src/zd1205.c: In function ‘zdcb_dis_intr’:
/home/rob/Documenti/ZD1211LnxDrv_2_22_0_0/src/zd1205.c:10858: error: ‘struct net_device’ has no member named ‘priv’
/home/rob/Documenti/ZD1211LnxDrv_2_22_0_0/src/zd1205.c:10862: warning: comparison of distinct pointer types lacks a cast
/home/rob/Documenti/ZD1211LnxDrv_2_22_0_0/src/zd1205.c: In function ‘zdcb_set_intr_mask’:
/home/rob/Documenti/ZD1211LnxDrv_2_22_0_0/src/zd1205.c:10872: error: ‘struct net_device’ has no member named ‘priv’
/home/rob/Documenti/ZD1211LnxDrv_2_22_0_0/src/zd1205.c:10875: warning: comparison of distinct pointer types lacks a cast
/home/rob/Documenti/ZD1211LnxDrv_2_22_0_0/src/zd1205.c: In function ‘zdcb_check_tcb_avail’:
/home/rob/Documenti/ZD1211LnxDrv_2_22_0_0/src/zd1205.c:10899: error: ‘struct net_device’ has no member named ‘priv’
/home/rob/Documenti/ZD1211LnxDrv_2_22_0_0/src/zd1205.c:10904: warning: comparison of distinct pointer types lacks a cast
/home/rob/Documenti/ZD1211LnxDrv_2_22_0_0/src/zd1205.c:10910: warning: comparison of distinct pointer types lacks a cast
/home/rob/Documenti/ZD1211LnxDrv_2_22_0_0/src/zd1205.c: In function ‘zdcb_delay_us’:
/home/rob/Documenti/ZD1211LnxDrv_2_22_0_0/src/zd1205.c:10917: error: ‘struct net_device’ has no member named ‘priv’
/home/rob/Documenti/ZD1211LnxDrv_2_22_0_0/src/zd1205.c: In function ‘zdcb_AcquireDoNotSleep’:
/home/rob/Documenti/ZD1211LnxDrv_2_22_0_0/src/zd1205.c:10961: error: ‘struct net_device’ has no member named ‘priv’
/home/rob/Documenti/ZD1211LnxDrv_2_22_0_0/src/zd1205.c: In function ‘zdcb_ReleaseDoNotSleep’:
/home/rob/Documenti/ZD1211LnxDrv_2_22_0_0/src/zd1205.c:10967: error: ‘struct net_device’ has no member named ‘priv’
/home/rob/Documenti/ZD1211LnxDrv_2_22_0_0/src/zd1205.c: In function ‘zd1205_set_zd_cbs’:
/home/rob/Documenti/ZD1211LnxDrv_2_22_0_0/src/zd1205.c:11057: warning: assignment from incompatible pointer type
/home/rob/Documenti/ZD1211LnxDrv_2_22_0_0/src/zd1205.c: In function ‘ChangeMacMode’:
/home/rob/Documenti/ZD1211LnxDrv_2_22_0_0/src/zd1205.c:11611: error: ‘struct net_device’ has no member named ‘priv’
/home/rob/Documenti/ZD1211LnxDrv_2_22_0_0/src/zd1205.c:11612: error: ‘struct net_device’ has no member named ‘priv’
/home/rob/Documenti/ZD1211LnxDrv_2_22_0_0/src/zd1205.c: In function ‘zd1205_iw_getstats’:
/home/rob/Documenti/ZD1211LnxDrv_2_22_0_0/src/zd1205.c:11635: error: ‘struct net_device’ has no member named ‘priv’
make[4]: *** [/home/rob/Documenti/ZD1211LnxDrv_2_22_0_0/src/zd1205.o] Error 1
make[3]: *** [_module_/home/rob/Documenti/ZD1211LnxDrv_2_22_0_0] Error 2
make[3]: Leaving directory `/usr/src/linux-2.6.29.3-desktop586-1mnb'
make[2]: *** [all] Error 2
make[2]: Leaving directory `/home/rob/Documenti/ZD1211LnxDrv_2_22_0_0'
make[1]: *** [both] Error 2
make[1]: Leaving directory `/home/rob/Documenti/ZD1211LnxDrv_2_22_0_0'
make: *** [all] Error 2
[rob@localhost ZD1211LnxDrv_2_22_0_0]$

Ritratto di Moreno
Moreno
(Guru)
Offline
Guru
Iscritto: 24/09/2004
Messaggi: 16862

Ciao

ma perché vuoi farti del male??
I driver ZD1211 sono integrati nel kernel da parecchio.

Ciao Ciao, Moreno

Addio, e grazie per tutto il pesce.
Avatar by moonlight-dream.

Ritratto di robren66
robren66
(Junior)
Offline
Junior
Iscritto: 07/11/2005
Messaggi: 31

si lo so infatti li sto usando ...ma sto facendo alcune prove con un programma e mi servono questi...

Ritratto di Moreno
Moreno
(Guru)
Offline
Guru
Iscritto: 24/09/2004
Messaggi: 16862

Ciao

Non funzionano più da una vita, ho aperto un Bug Report al proposito nel lontano 2006 https://qa.mandriva.com/show_bug.cgi?id=25827

Ciao Ciao, Moreno

Addio, e grazie per tutto il pesce.
Avatar by moonlight-dream.